everyday life in consumer culture
type: Concept
narrower: T-shirts

concepts
type: Collection
type: ConceptGroup
member: T-shirts

T-shirts
definition: The T-shirt is one of the most successful consumer items in American culture. Over one billion T-shirts are purchased annually in the United States. [Source: Encyclopedia of Consumer Culture; T-Shirts]
broader: everyday life in consumer culture
type: Concept