TWA flight 847 hijacking
definition: On June 14, 1985, two gunmen used hand grenades and a pistol to overpower a commercial jet bound for Rome from Athens. The 153 passengers and crew members aboard Trans World Airlines Flight 847, many of them Americans, were caught in a 16-day showdown as the plane flew back and forth between Beirut and Algiers. [Source: The SAGE Encyclopedia of Terrorism; Twa Flight 847 Hijacking]
broader: terrorist events
type: Concept

events
type: Collection
type: ConceptGroup
member: TWA flight 847 hijacking

terrorist events
type: Concept
narrower: TWA flight 847 hijacking