feminism/gender
type: Concept
narrower: Take Back the Night

concepts
type: Collection
type: ConceptGroup
member: Take Back the Night

Take Back the Night
definition: Take Back the Night refers to rallies, marches, and vigils that have emerged within the United States over the past 30 years as important components of the anti-rape movement. These events are intended as protests against sexual violence and symbolize women's right to be free from rape on the streets and in their own homes. [Source: Encyclopedia of Interpersonal Violence; Take Back the Night]
broader: feminism/gender
type: Concept