Tambor de Mina
definition: Tambor de Mina is the most common name for the religion of African origin in Maranhão and the Brazilian Amazon region. From the 1950s, due to the migration of African descendants, it spread to other areas, mainly Rio de Janeiro, São Paulo, Brasília, and Paraná. The name tambor (drum) derives from the importance of this instrument in the rituals and Mina, from the former Portuguese fort of São Jorge da Mina, a warehouse for slaves established in the region where Ghana is located today, that is, West Africa. [Source: Encyclopedia of Global Religion; Tambor De Mina]
broader: movements and organizations
type: Concept

movements and organizations
type: Concept
narrower: Tambor de Mina

concepts
type: Collection
type: ConceptGroup
member: Tambor de Mina