Tasmania
definition: The first evidence of human habitation on Tasmania dates from around23,000–25,000 years ago, when the Bass Strait was actually a land bridge and allowed for easy passage between the mainland and Tasmania. Then, between 8,000–12,000 years ago, with the warming of the Earth, the Strait flooded, leaving the small population stranded for the longest period of human isolation ever. [Source: Encyclopedia of Anthropology; Tasmania]
broader: Australia
type: Concept

concepts
type: Collection
type: ConceptGroup
member: Tasmania

Australia
type: Concept
narrower: Tasmania