concepts
type: Collection
type: ConceptGroup
member: Tyler rationale

curriculum theory
type: Concept
narrower: Tyler rationale

Tyler rationale
definition: The Tyler Rationale consists of four fundamental questions that first appeared during the late 1940s in Ralph W. Tyler's curriculum syllabus, Basic Principles of Curriculum and Instruction. This document is still in print and continues to sell thousands of copies each year. [Source: Encyclopedia of Curriculum Studies; Tyler Rationale, The]
broader: curriculum theory
type: Concept