institutions studying climate change
type: Concept
narrower: University of Maryland

University of Maryland
definition: The University of Maryland (UMD) refers to the University of Maryland, College Park. UMD is the flagship institution of the University System of Maryland. [Source: Encyclopedia of Global Warming & Climate Change; University of Maryland]
broader: institutions studying climate change
type: Concept

organizations
type: Collection
type: ConceptGroup
member: University of Maryland