institutions studying climate change
type: Concept
narrower: Utah Climate Center

Utah Climate Center
definition: THE UTAH CLIMATE Center aims to disseminate climate data and information and to use expertise in atmospheric science to interpret climate information in an accurate and original way for the public. The mission includes the design of new products to meet the present and future needs of agriculture, natural resources, government, industry, tourism, and educational organizations in Utah and the intermountain region. [Source: Encyclopedia of Global Warming and Climate Change; Utah Climate Center]
broader: institutions studying climate change
type: Concept

organizations
type: Collection
type: ConceptGroup
member: Utah Climate Center