Venerable Master Cheng-yen
definition: Venerable Master Cheng-yen is the founder of the Tzu Chi Foundation, one of the largest Buddhist philanthropic organizations in the world. She was born in 1937 into a middle-class family in the central city of Taizhong, Taiwan. [Source: Encyclopedia of Global Religion; Venerable Master Cheng-Yen (b. 1937)]
broader: key people in global religion
type: Concept

people
type: Collection
type: ConceptGroup
member: Venerable Master Cheng-yen

key people in global religion
type: Concept
narrower: Venerable Master Cheng-yen