Victims Bill of Rights
definition: Between 1980 and 2000, every U.S. state enacted a victims' bill of rights, either as an amendment to its state constitution or as a statute designed to promote and preserve the rights of victims of crime in criminal prosecutions. By any fair measure, these laws indicated a strong national consensus that a new emphasis was needed on the rights of victims in the criminal justice process. [Source: Encyclopedia of Crime and Punishment; Victims' Bill of Rights]
broader: victimology
type: Concept

victimology
type: Concept
narrower: Victims Bill of Rights

concepts
type: Collection
type: ConceptGroup
member: Victims Bill of Rights