Vietnam
definition: Vietnam is a long, narrow country located in southeast Asia, covering an area of 330,363 sq. km. [Source: Encyclopedia of Business in Today's World; Vietnam]
broader: Southeastern Asia
type: Concept

concepts
type: Collection
type: ConceptGroup
member: Vietnam

Southeastern Asia
type: Concept
narrower: Vietnam