assessment areas and techniques
type: Concept
narrower: Vocational Preference Inventory

concepts
type: Collection
type: ConceptGroup
member: Vocational Preference Inventory

Vocational Preference Inventory
definition: The Vocational Preference Inventory (VPI) is one of two inventories operationalizing John L. Holland's person-environment fit theory. [Source: Encyclopedia of Career Development; Vocational Preference Inventory (VPI)]
broader: assessment areas and techniques
type: Concept