Walt Whitman
definition: For many people, the name of Walt Whitman, arguably America's greatest poet, is virtually synonymous with social activism. They perhaps recall in his poetry some impassioned lines about slaves at auction, or lines grousing about puritanical attitudes toward sexuality, or a passage adamantly insisting on the principles of democracy. [Source: Encyclopedia of Activism and Social Justice; Whitman, Walt (1819–1892)]
broader: literature and activism
type: Concept

literature and activism
type: Concept
narrower: Walt Whitman

people
type: Collection
type: ConceptGroup
member: Walt Whitman