Weather World 2010 project
definition: DEVELOPED BY THE Department of Atmospheric Sciences (DAS) at the University of Illinois Urbana-Champaign (UIUC), the Weather World 2010 project (WW2010) is a WWW framework for integrating current and archived weather data with multimedia instructional resources, using new and innovative technologies. The project focuses on many different manifestations of global warming such as hurricanes, clouds and precipitation, and El Nino. [Source: Encyclopedia of Global Warming and Climate Change; Weather World 2010 Project]
broader: institutions studying climate change
type: Concept

institutions studying climate change
type: Concept
narrower: Weather World 2010 project

concepts
type: Collection
type: ConceptGroup
member: Weather World 2010 project