World Meteorological Organization
definition: The World Meteorological Organization (WMO) is a specialized agency of the United Nations (UN). It articulates UN policy on the state and behavior of the Earth's atmosphere, its interaction with the oceans, the climate it produces, and the resulting distribution of water resources. [Source: Encyclopedia of Global Warming & Climate Change; World Meteorological Organization]
broader: institutions studying climate change
type: Concept

institutions studying climate change
type: Concept
narrower: World Meteorological Organization

organizations
type: Collection
type: ConceptGroup
member: World Meteorological Organization