absentee voting
definition: Absentee voting is a process that provides people the opportunity to cast a ballot even if they are unwilling or unable to appear at a polling station. Absentee voting is common in developed democracies, such as the United States, Japan, and the nations of western Europe. [Source: The Encyclopedia of Political Science; Absentee Voting]
broader: representation and electoral systems
type: Concept

representation and electoral systems
type: Concept
narrower: absentee voting

concepts
type: Collection
type: ConceptGroup
member: absentee voting