toys
type: Concept
narrower: action figures

concepts
type: Collection
type: ConceptGroup
member: action figures

action figures
definition: Although action figures are an integral part of a boy's upbringing in the United States, this was not always the case. At one point in our history action figures were simply unheard of. [Source: Encyclopedia of Play in Today's Society; Action Figures]
broader: toys
type: Concept