playgrounds
type: Concept
narrower: adventure playgrounds

adventure playgrounds
definition: An adventure playground is a nonasphalted, fenced-off area containing a play hut for indoor recreation and natural areas for the construction of play structures, which might include rope swings, slides, water play, and dens. The requirements for an adventure playground include provision of tools (e.g., hammers, spades, saws, chisels, screwdrivers, and axes) and materials (wood, nails, rope, bricks, and other building material) children can use to explore new play opportunities or change their activities. [Source: Encyclopedia of Play in Today's Society; Adventure Playgrounds]
broader: playgrounds
type: Concept

concepts
type: Collection
type: ConceptGroup
member: adventure playgrounds