all fives
definition: All Fives can refer to both a card game played with a standard deck and a Dominoes game played with a double six set. Card Game The card game is part of the All Fours family, descended from the English card game All Fours and played in most former English colonies, especially the West Indies. [Source: Encyclopedia of Play in Today's Society; All Fives]
broader: card games
type: Concept

concepts
type: Collection
type: ConceptGroup
member: all fives

card games
type: Concept
narrower: all fives