planning, strategy, and command and control
type: Concept
narrower: all volunteer force

concepts
type: Collection
type: ConceptGroup
member: all volunteer force

all volunteer force
definition: In July 1973, military conscription (the draft) in the United States ended in favor of the all volunteer force (AVF). The decision to end conscription was prompted by the popular dissatisfaction with the Vietnam War that was partly expressed in protests against the draft. [Source: Encyclopedia of War & American Society; All Volunteer Force]
broader: planning, strategy, and command and control
type: Concept