angel makers
definition: Angel makers are women who agree to care for foster children for a fee but neglect them until the child dies. But historically two types of angel makers can be identified. [Source: Encyclopedia of Death and the Human Experience; Angel Makers]
broader: mass death
type: Concept

concepts
type: Collection
type: ConceptGroup
member: angel makers

mass death
type: Concept
narrower: angel makers