apollonian
definition: Apollonian refers to something or someone presenting the main characteristics of Apollo. Apollo was one of the gods of the ancient Greeks, son of Zeus and Leto, and twin brother of Artemis. [Source: Encyclopedia of Anthropology; Apollonian]
broader: research/theoretical frameworks
type: Concept

research/theoretical frameworks
type: Concept
narrower: apollonian

concepts
type: Collection
type: ConceptGroup
member: apollonian