climate models
type: Concept
narrower: atmospheric component of models

atmospheric component of models
definition: Scientists have been creating models of the climate and atmosphere on a systematic basis for more than a century. However, only with the development of powerful computational devices has a sophisticated simulation of the atmosphere started to become possible. [Source: Encyclopedia of Global Warming & Climate Change; Atmospheric Component of Models]
broader: climate models
type: Concept

concepts
type: Collection
type: ConceptGroup
member: atmospheric component of models