social cognition
type: Concept
narrower: attributional ambiguity

attributional ambiguity
definition: Definition Attributional ambiguity is a psychological state of uncertainty about the cause of a person's outcomes or treatment. It can be experienced with regard to one's own outcomes or treatment or those of another person, and with regard to positive as well as negative outcomes or treatment. [Source: Encyclopedia of Social Psychology; Attributional Ambiguity]
broader: social cognition
type: Concept

concepts
type: Collection
type: ConceptGroup
member: attributional ambiguity