auditory scene analysis
definition: When we listen, we effortlessly hear the separate sounds of our environment—voices, musical instruments, cars—each coming from its appropriate direction and having its own characteristic qualities such as pitch and timbre. This simple perceptual experience is the result of the complex brain mechanisms of auditory scene analysis (ASA), described in this entry. [Source: Encyclopedia of Perception; Auditory Scene Analysis]
broader: audition
type: Concept

audition
type: Concept
narrower: auditory scene analysis

methods
type: Collection
type: ConceptGroup
member: auditory scene analysis