social cognition
type: Concept
narrower: automatic processes

concepts
type: Collection
type: ConceptGroup
member: automatic processes

automatic processes
definition: Definition Automatic processes are unconscious practices that happen quickly, do not require attention, and cannot be avoided. Analysis Imagine you are driving a very familiar route, such as your daily route to school, the university, or your work. [Source: Encyclopedia of Social Psychology; Automatic Processes]
broader: social cognition
type: Concept