corporate crisis management
type: Concept
narrower: backup strategy

backup strategy
definition: The purpose of a backup strategy is to create and maintain the ability to recover data that are required to perform one or more necessary functions. Prior to designing a backup strategy, the functions must be prioritized, the required data identified, and the recovery objectives defined. [Source: Encyclopedia of Crisis Management; Backup Strategy]
broader: corporate crisis management
type: Concept

concepts
type: Collection
type: ConceptGroup
member: backup strategy