bezique
definition: Bezique was originally a French card game dating back to the 17th century; it is similar to Piquet, from which it is derived. It is, in its basic form, a two-player game, although there are variations for more players. [Source: Encyclopedia of Play in Today's Society; Bezique]
broader: card games
type: Concept

concepts
type: Collection
type: ConceptGroup
member: bezique

card games
type: Concept
narrower: bezique