biblical archaeology
definition: Biblical or Near Eastern archaeology reconstructs the histories and societies of the Near East from human ancestors' first migrations out of Africa 1.5 million years ago to the end of the Ottoman Empire in1918 CE through archaeological evidence and historical documents. Geography and Climate Although the archaic geographic term Near Easthas been largely replaced by Middle East in popular and political language, the Near East remains an operative term in archaeological research, alongside Anatolian, Arabian, Levantine, Mesopotamian, southwest Asia, and Syro-Palestinian. [Source: Encyclopedia of Anthropology; Archaeology, Biblical]
broader: archaeology
type: Concept

archaeology
type: Concept
narrower: biblical archaeology

concepts
type: Collection
type: ConceptGroup
member: biblical archaeology