bison
definition: Once found throughout most of the Northern Hemisphere, bison are now found only in limited areas of North America and Europe. Large herbivores, bison typically move in herds composed of cows, calves, and adolescent or elderly males. [Source: Encyclopedia of Environment and Society; Bison]
broader: animals
type: Concept

concepts
type: Collection
type: ConceptGroup
member: bison

animals
type: Concept
narrower: bison