bivariate regression
definition: Regression is a statistical technique used to help investigate how variation in one or more variables predicts or explains variation in another variable. This popular statistical technique is flexible in that it can be used to analyze experimental or nonexperimental data with multiple categorical and continuous independent variables. [Source: Encyclopedia of Research Design; Bivariate Regression]
broader: regression analysis
type: Concept

regression analysis
type: Concept
narrower: bivariate regression

methods
type: Collection
type: ConceptGroup
member: bivariate regression