diversity in education
type: Concept
narrower: black intellectuals

concepts
type: Collection
type: ConceptGroup
member: black intellectuals

black intellectuals
definition: A review of Black history and culture will reveal any number of African American intellectuals on the Black sociocultural and political landscape: literary intellectuals, political intellectuals, economic intellectuals, “organic” intellectuals, worker's intellectuals, community intellectuals, and others. Central to their thinking is a devotion to ideas and the dissemination of such ideas, in the form of the written word, the lecture, or works of art. [Source: Encyclopedia of Race, Ethnicity, and Society; Black Intellectuals]
broader: diversity in education
type: Concept