representation and electoral systems
type: Concept
narrower: block vote

concepts
type: Collection
type: ConceptGroup
member: block vote

block vote
definition: Block voting is an electoral system used by multimember electoral wards or districts in which voters cast as many votes as there are seats in the area. In one form of the system, citizens may cast their votes for candidates irrespective of the party affiliation of the office seekers. [Source: The Encyclopedia of Political Science; Block Vote]
broader: representation and electoral systems
type: Concept