vessels
type: Concept
narrower: boats

concepts
type: Collection
type: ConceptGroup
member: boats

boats
definition: The earliest records of boats in Africa come from the civilization of ancient Egypt. Because human origin and human civilization occurred first on the continent of Africa, it seems logical that Africa would be the place where humans first created river crafts. [Source: Encyclopedia of African Religion; Boats]
broader: vessels
type: Concept