bottled water
definition: Bottled water in the United States is regulated by different agencies than those that regulate drinking water. Because of this, there are differences in the reporting requirements for water testing that make it more difficult to determine the safety and content of bottled water when compared to tap water. [Source: Green Health: An A-to-Z Guide; Bottled Water]
broader: drinking water
type: Concept

concepts
type: Collection
type: ConceptGroup
member: bottled water

drinking water
type: Concept
narrower: bottled water