box-score method
definition: An elementary first step in synthesizing research in ∗meta-analysis, named after its similarity to scorekeeping in baseball. Basically, one simply tallies the various research reports in terms of whether each supports or fails to support the hypothesis being studied. [Source: Dictionary of Statistics & Methodology; Box-Score Method]
broader: meta-analysis
type: Concept

meta-analysis
type: Concept
narrower: box-score method

methods
type: Collection
type: ConceptGroup
member: box-score method