bureau shaping
definition: Bureau shaping involves molding a bureaucracy in a manner that maximizes the utility of a rational self-interested official. Economic theories, in particular public choice theory, assumed an increasingly significant role in political science during the latter part of the twentieth century. [Source: Encyclopedia of Governance; Bureau Shaping]
broader: Rational Choice Theory
type: Concept

concepts
type: Collection
type: ConceptGroup
member: bureau shaping

Rational Choice Theory
type: Concept
narrower: bureau shaping