burnout assessment
definition: Introduction Job burnout is a prolonged response to chronic interpersonal stressors on the job. It has been recognized as an occupational hazard for various people-oriented professions, such as human services, education, and health care. [Source: Encyclopedia of Psychological Assessment; Burnout Assessment]
broader: personality assessment
type: Concept

methods
type: Collection
type: ConceptGroup
member: burnout assessment

personality assessment
type: Concept
narrower: burnout assessment