bushido
definition: Bushido is an ethical system based on the relationship between a samurai warrior and his overlord. The essential feature of this ethic is the relationship between master and vassal, with allegiance owed to the master by the samurai and care owed to the vassal warrior by the master. [Source: Encyclopedia of Business Ethics and Society; Bushido]
broader: applied business ethics
type: Concept

applied business ethics
type: Concept
narrower: bushido

concepts
type: Collection
type: ConceptGroup
member: bushido