cartographic modeling
definition: Cartographic modeling is a general methodology for the analysis and synthesis of geospatial data. It has been incorporated into a number of raster-oriented geographic information systems, and it can be used to address a variety of applications in a unified manner. [Source: Encyclopedia of Geographic Information Science; Cartographic Modeling]
broader: analytical methods
type: Concept

analytical methods
type: Concept
narrower: cartographic modeling

methods
type: Collection
type: ConceptGroup
member: cartographic modeling