records (forms)
type: Concept
narrower: case records

case records
definition: Case, medical, and health records refer to the systematic documentation of a patient's medical history and care. Differences between health and medical records lie in the extensiveness of documentation. [Source: Cultural Sociology of Mental Illness: An A-to-Z Guide; Case Records]
broader: records (forms)
type: Concept

concepts
type: Collection
type: ConceptGroup
member: case records