child mortality
definition: Child survival against poverty is a major issue in the millennium. The importance of the survival of children for the future of a race is the reason for the global community’s concern about child mortality. [Source: The SAGE Encyclopedia of World Poverty; Child Mortality]
broader: mortality
type: Concept

mortality
type: Concept
narrower: child mortality

concepts
type: Collection
type: ConceptGroup
member: child mortality