concepts
type: Collection
type: ConceptGroup
member: chronicity

chronicity
definition: The word chronicity can imply many things when related to substance use and addiction. Most typically, it references the chronic nature of addiction and the reoccurrence, or the more stigmatizing term relapse, of the illness. [Source: Encyclopedia of Substance Abuse Prevention, Treatment, & Recovery; Chronicity]
broader: models of addiction
type: Concept

models of addiction
type: Concept
narrower: chronicity