citizen informants
definition: Citizen informants are identified individuals who inform police officers about criminal activity committed by others. Their information is considered to be more reliable than that of anonymous informants, criminal informants, or informants in the criminal milieu. [Source: Encyclopedia of the Fourth Amendment; Citizen Informants]
broader: Fourth Amendment issues
type: Concept

Fourth Amendment issues
type: Concept
narrower: citizen informants

concepts
type: Collection
type: ConceptGroup
member: citizen informants