geographic information systems
type: Concept
narrower: client-server architecture

client-server architecture
definition: In the client-server architecture, clients and servers communicate with one another via a network connection. This architecture is composed of a distributed computing system with software on both the client and the server. [Source: Encyclopedia of Geography; Client-Server Architecture]
broader: geographic information systems
type: Concept

concepts
type: Collection
type: ConceptGroup
member: client-server architecture