planning, strategy, and command and control
type: Concept
narrower: coastal patrolling

concepts
type: Collection
type: ConceptGroup
member: coastal patrolling

coastal patrolling
definition: Coastal patrolling is vital to a maritime nation such as the United States. Nearly 95 percent of all American foreign trade, valued at over $1.7 trillion, travels by sea. [Source: Encyclopedia of War & American Society; Coastal Patrolling]
broader: planning, strategy, and command and control
type: Concept