cognitive structures
definition: Cognitive structures refers to distinct subprocesses or mechanisms identifiable in mental information processing that mediate consumers' reactions to external stimuli. Cognitive structures is the generic term for a huge variety of different aspects related to the way humans process, store, retrieve, and use information for decision making. [Source: Encyclopedia of Consumer Culture; Cognitive Structures]
broader: learning and perception
type: Concept

learning and perception
type: Concept
narrower: cognitive structures

concepts
type: Collection
type: ConceptGroup
member: cognitive structures