collaborative GIS
definition: Local and global problems such as land use and land cover change, poverty and deprivation, health and diseases, and global warming are all directly linked to the intricate biophysical and sociopolitical networks operating within geographic space. Resolving the complex issues embedded in these problems requires the involvement of multiple interest groups, reliable baseline geographic data, and relevant decision support technologies. [Source: Encyclopedia of Geography; Collaborative GIS]
broader: geographic information systems
type: Concept

geographic information systems
type: Concept
narrower: collaborative GIS

concepts
type: Collection
type: ConceptGroup
member: collaborative GIS