postsecondary education
type: Concept
narrower: college advising

college advising
definition: Advising, like other educational activities, is concerned with student development and learning. Advisors promote these basic tenets by supporting students in creating and fulfilling educational and life goals. [Source: Sociology of Education: An A-to-Z Guide; College Advising]
broader: postsecondary education
type: Concept

concepts
type: Collection
type: ConceptGroup
member: college advising