college student communities
definition: Most college students become members of one or more communities during their college career. These communities, which function as social networks for college students, can be formal or informal and may be formed at the beginning or near the end of a college student's experience. [Source: Encyclopedia of Social Networks; College Students Communities]
broader: social networking communities
type: Concept

concepts
type: Collection
type: ConceptGroup
member: college student communities

social networking communities
type: Concept
narrower: college student communities